test_ctypes.py fails with ActivePython 2.5.1.1

Posted by DanRawson on 2008-09-03 07:25

I'm installing ActivePython 2.5.1.1 on Windows XP Pro (SP2). After the install, I was running Lib\test\testall.py . . . and a couple of the tests fail. With one exception, they complete successfully if I run the tests individually. However, test_ctypes.py always fails:

FAILED (errors=1)
Traceback (most recent call last):
File "Lib\test\test_ctypes.py", line 12, in
test_main()
File "Lib\test\test_ctypes.py", line 9, in test_main
run_suite(unittest.TestSuite(suites))
File "C:\localdata\root\util\python25\lib\test\test_support.py", line 426, in run_suite
raise TestFailed(err)
test.test_support.TestFailed: Traceback (most recent call last):
File "C:\localdata\root\util\python25\lib\ctypes\test\test_loading.py", line 42, in test_find
cdll.LoadLibrary(lib)
File "C:\localdata\root\util\python25\lib\ctypes\__init__.py", line 423, in LoadLibrary
return self._dlltype(name)
File "C:\localdata\root\util\python25\lib\ctypes\__init__.py", line 340, in __init__
self._handle = _dlopen(self._name, mode)
WindowsError: [Error 126] The specified module could not be found

and cdll doesn't exist as a module that I can find . . . .

Is this a known bug?

Thanks!